{"text_format":"3","workbook":"xlsx","n_sheets":5,"sheets":["Master Data","Extra Ded. ","GA55","COMPUTATION","Form No. 16"],"not_rendered":{"images":2,"external_links":3,"defined_names":8},"read":"whole","date_system":"1900"}

{"sheet":"Master Data","index":0,"n_rows":33,"n_cols":19,"rows_kept":33,"merged":[[1,1,1,4],[2,2,2,4],[9,5,10,5],[19,3,19,4],[20,3,20,4],[21,3,21,4],[22,3,22,4],[23,3,23,4]]}
[]
[null,"MASTER DATA",{"$nulls":15},"L-1","CDEO"]
[null,"कार्यालय का नाम ( पीईईओ या सीबीईओ )  : ","Mahatma Gandhi Government School (English Medium) Bar, (Beawar)",{"$nulls":14},"L-2","DEEO"]
[null,"कार्मिक का नाम  :","HEERALAL JAT","Designation /  पद :","Sr. Teacher",{"$nulls":12},"L-3","ADEO"]
[null,"Gazetted / Non-Gazetted : ","Non-Gazetted","Employee ID :","RJPA200312345678",{"$nulls":12},"L-4","ADPC"]
[null,"School/Office Name  :","MGGS BAR","DDO Name  :","Usha Paliya",{"$nulls":12},"L-5","APC"]
[null,"PAN No. :","ABCDE5555H","बैंक खाता संख्या :","51XXXXXXXXX96",{"$nulls":12},"L-6","CBEO"]
[null,"SI Number :","74XXX7","GPF / GPF - 2004  :","GPF",{"$nulls":12},"L-7","ACBEO-1"]
{"$rows_left_out":26}
{"sheet":"Extra Ded. ","index":1,"n_rows":25,"n_cols":11,"rows_kept":25,"merged":[[0,0,0,2],[1,1,1,2],[2,2,2,10],[5,2,5,3],[5,5,23,5],[5,6,5,9],[5,11,23,11],[6,2,6,3],[6,6,6,9],[7,2,7,3],[7,6,7,9],[8,2,8,3],[8,6,8,9],[9,2,9,3],[9,6,9,9],[10,2,10,3],[10,6,10,9],[11,2,11,3],[11,6,11,9],[12,2,12,3],[12,6,12,9],[13,2,13,3],[13,6,13,9],[14,2,14,3],[14,6,14,9],[15,2,15,3],[15,6,15,9],[16,2,16,3],[16,6,16,9],[17,2,17,3],[17,6,17,9],[18,2,18,3],[18,6,18,9],[18,10,19,10],[19,2,19,3],[20,2,20,3],[20,6,20,9],[21,2,21,3],[21,6,21,9],[22,2,22,3],[22,6,22,9],[23,2,23,3],[23,6,23,9],[24,2,24,3],[24,6,24,9],[25,2,25,10]]}
["https://youtu.be/ULIKPcv3e-U"]
[null,"अधिक जानकारी के लिए ऊपर Youtube video का लिंक दिया गया है। "]
[null,null,"वेतन कटौती से अतिरिक्त कटौतिया जिसके तहत आप आयकर में छूट लेना चाहते है, तथा अतिरिक्त (अन्य) आय को यहाँ इन्द्राज करेंI"]
[]
[]
[null,null,"1. मकान किराया भत्ता (यदि रसीद के माध्यम से छूट लेनी हो तो राशि लिखे )",null,0,null,"20.  इक्विटी लिंक सेविंग स्कीम "]
[null,null,"2.  स्टैण्डर्ड डीडेक्सन (Standard Deduction)  75,000 (अधिकतम )",null,75000,null,"21.  गृह किराया धारा 10 (13-A) के अंतर्गत व धारा  10(14) के अंतर्गत  अन्य भत्ते जो कर मुक्त है "]
[null,null,"3. मनोरंजन भत्ता धारा  16  (ii) के अंतर्गत ",{"$nulls":3},"22. स्थगत वार्षिकी (Defferred Annuty)"]
{"$rows_left_out":18}
{"sheet":"GA55","index":2,"n_rows":41,"n_cols":76,"rows_kept":41,"merged":[[0,1,0,27],[1,0,1,2],[1,3,1,7],[1,8,1,11],[1,12,1,15],[1,16,1,19],[1,20,1,26],[1,27,1,28],[2,0,2,1],[2,2,2,4],[2,6,2,8],[2,10,2,13],[2,14,2,16],[2,17,2,21],[2,22,2,25],[2,26,2,28],[3,0,3,12],[3,13,3,25],[3,26,4,26],[3,27,4,27],[3,28,4,28],[4,30,4,32],[5,30,5,32],[7,30,7,32],[28,2,28,7],[28,18,28,26],[29,2,29,7],[29,18,29,26]]}
[null,{"$f":"IF(AND('Master Data'!C3=\"\"),\"\",CONCATENATE(\"Office Name :- \",PROPER('Master Data'!C3)))","v":"Office Name :- Mahatma Gandhi Government School (English Medium) Bar, (Beawar)"}]
["Employee Name :-",null,null,{"$f":"UPPER(IF('Master Data'!C4=\"\",\"\",'Master Data'!C4))","v":"HEERALAL JAT"},{"$nulls":4},"Designation :-",{"$nulls":3},{"$f":"UPPER(IF('Master Data'!E4=\"\",\"\",'Master Data'!E4))","v":"SR. TEACHER"},{"$nulls":3},"Posting Place :-",{"$nulls":3},{"$f":"UPPER(IF('Master Data'!C6=\"\",\"\",'Master Data'!C6))","v":"MGGS BAR"},{"$nulls":6},"वेतन ड्रा मानचित्र "]
["PAN No. :-",null,{"$f":"UPPER(IF('Master Data'!C7=\"\",\"\",'Master Data'!C7))","v":"ABCDE5555H"},null,null,"SI No.",{"$f":"IF(AND('Master Data'!C8=\"\"),\"\",'Master Data'!C8)","v":"74XXX7"},null,null,"GPF",{"$f":"IF(AND('Master Data'!C9=\"\"),\"\",'Master Data'!C9)","v":"74XXX8"},{"$nulls":3},"PRAN No. :-",null,null,{"$f":"IF(AND('Master Data'!E9=\"\"),\"\",'Master Data'!E9)","v":"71XXX10"},{"$nulls":4},"Bank A/C.",{"$nulls":3},{"$f":"IF(AND('Master Data'!E7=\"\"),\"\",'Master Data'!E7)","v":"51XXXXXXXXX96"},{"$nulls":24},{"$f":"AZ15-ROUNDUP(ROUND((AZ15*3%)-(AZ15*3%)*2.9%,-2),0)","v":59500}]
["Pay received",{"$nulls":12},"Deducations",{"$nulls":12},"NET PAY","T.V. NO.","Enc.  DATE"]
["S.N.","Month","Basic With Grade Pay","DA","HRA","Wash All.","Handi. All.","CCA","Other-1","Other-2","Bonus","ROP","TOTAL","SI",{"$f":"IF('Master Data'!E8=\"\",\"\",'Master Data'!E8)","v":"GPF"},"L.I.C.","RGHS","SI Loan","GPF Loan","SI Int.","Other-1","HITKARI NIDHI","Other-2","Income Tax","Group Ins.","Total Ded.",{"$nulls":4},"https://youtu.be/GXryKE2B7fI",{"$nulls":7},{"$f":"'Master Data'!C12","v":"YES"},"GPF","Yes","Regular Pay","Under 60",null,1000]
[1,{"$f":"IFERROR(IF(BO12=\"\",\"\",BO12),\"\")","v":"2025-03-01"},{"$f":"IFERROR(IF(B6=\"\",\"\",IF(AND(BQ12=\"\"),\"\",IF(B6=$AX$24,\"\",IF(AND('Master Data'!$C$14=$AP$6),VLOOKUP(B6,om,13,0),VLOOKUP(B6,om,4,0))))),\"\")","v":61300},{"$f":"IFERROR(IF(B6=\"\",\"\",IF(AND(BQ12=\"\"),\"\",IF(OR(B6=$AX$24),\"\",IF(AND('Master Data'!$C$14=$AP$5),VLOOKUP(B6,om,7,0),\"\")))),\"\")","v":32489},{"$f":"IFERROR(IF(B6=\"\",\"\",IF(AND(BQ12=\"\"),\"\",IF(OR(B6=$AX$24,B6=$AX$25,B6=$AX$26,B6=$AX$27,B6=$AX$28,B6=$AX$29),\"\",IF(AND('Master Data'!$C$14=$AP$5),VLOOKUP(B6,om,8,0),\"\")))),\"\")","v":6130},0,{"$f":"IFERROR(IF(B6=\"\",\"\",IF(AND(BQ12=\"\"),\"\",IF(OR(B6=$AX$24,B6=$AX$25,B6=$AX$26,B6=$AX$27,B6=$AX$28,B6=$AX$29),\"\",IF(AND('Master Data'!$C$14=$AP$5),'Master Data'!$E$14,\"\")))),\"\")","v":0},{"$f":"IFERROR(IF(B6=\"\",\"\",IF(AND(BQ13=\"\"),\"\",IF('Master Data'!$E$12=\"NO\",\"\",IF(OR(B6=$AX$24,B6=$AX$25,B6=$AX$26,B6=$AX$27,B6=$AX$28,B6=$AX$29),\"\",IF(AND('Master Data'!$C$14=$AP$5),F6,IF(AND('Master Data'!$E$13=$AR$9),$AS$6,IF(AND('Master Data'!$E$13=$AR$10),$AS$6,IF(AND('Master Data'!$E$13=$AR$11),$AS$6,IF(AND('Master Data'!$E$13=$AR$12),$AS$6,$AS$5))))))))),\"\")","v":""},0,0,{"$f":"IFERROR(IF(B6=\"\",\"\",IF(AND('Master Data'!$C$14=$AP$6),\"\",IF(AND('Master Data'!$C$15<>0),IF(AND(B6=\"Bonus\"),VLOOKUP(B6,om,4,0),\"\")))),\"\")","v":""},0,{"$f":"IF(B6=\"\",\"\",SUM(C6:L6))","v":99919},{"$f":"IFERROR(IF(B6=\"\",\"\",IF(AND(BQ12=\"\"),\"\",IF(OR(B6=$AX$24,B6=$AX$25,B6=$AX$26,B6=$AX$27,B6=$AX$28,B6=$AX$29),\"\",IF(AND('Master Data'!$C$14=$AP$5),VLOOKUP(B6,om,11,0),\"\")))),\"\")","v":7000},{"$f":"IFERROR(IF(B6=\"\",\"\",IF(AND(BQ12=\"\"),\"\",IF(OR(B6=$AX$25),\"\",IF(AND('Master Data'!$C$14=$AP$5),VLOOKUP(B6,om,12,0),\"\")))),\"\")","v":7000},{"$f":"IFERROR(IF(B6=\"\",\"\",IF(AND(BQ12=\"\"),\"\",IF(OR(B6=$AX$24,B6=$AX$25,B6=$AX$26,B6=$AX$27,B6=$AX$28,B6=$AX$29),\"\",IF(AND('Master Data'!$C$14=$AP$5),'Master Data'!$E$16,\"\")))),\"\")","v":1103},{"$f":"IFERROR(IF(B6=\"\",\"\",IF(AND(BQ12=\"\"),\"\",IF(OR(B6=$AX$24,B6=$AX$25,B6=$AX$26,B6=$AX$27,B6=$AX$28,B6=$AX$29),\"\",IF(AND('Master Data'!$C$14=$AP$5),VLOOKUP(B6,om,10,0),\"\")))),\"\")","v":875},0,0,0,0,{"$f":"IFERROR(IF(OR('Master Data'!$C$14=$AP$6,B6=\"\"),\"\",IF(AND(C6=\"\"),\"\",IF(AND(B6=$AT$17,'Master Data'!$C$5=\"Gazetted\"),500,IF(AND(B6=$AT$17,'Master Data'!$C$5=\"Non-Gazetted\"),250,\"\")))),\"\")","v":""},0,{"$f":"IFERROR(IF(B6=\"\",\"\",IF(AND(BQ12=\"\"),\"\",IF(OR(B6=$AX$24,B6=$AX$25,B6=$AX$26,B6=$AX$27,B6=$AX$28,B6=$AX$29),\"\",IF(AND('Master Data'!$C$14=$AP$5),VLOOKUP(B6,om,9,0),\"\")))),\"\")","v":2000},{"$f":"IFERROR(IF(OR('Master Data'!$C$14=$AP$6,B6=\"\",'Master Data'!$C$11=\"\"),\"\",IF(AND(C6=\"\"),\"\",IF(B6=$AT$9,'Master Data'!$C$16,\"\"))),\"\")","v":""},{"$f":"IF(B6=\"\",\"\",SUM(N6:Y6))","v":17978},{"$f":"IFERROR(IF(AND(B6=\"\",M6=\"\",Z6=\"\"),\"\",SUM(M6-Z6)),\"\")","v":81941},{"$nulls":3},"Youtube Video Link For Your Help",{"$nulls":8},"GPF-2004","No","Fix Pay","Above 60",null,620]
[2,{"$f":"IFERROR(IF(BO13=\"\",\"\",BO13),\"\")","v":"2025-04-01"},{"$f":"IFERROR(IF(B7=\"\",\"\",IF(AND(BQ13=\"\"),\"\",IF(B7=$AX$24,\"\",IF(AND('Master Data'!$C$14=$AP$6),VLOOKUP(B7,om,13,0),VLOOKUP(B7,om,4,0))))),\"\")","v":61300},{"$f":"IFERROR(IF(B7=\"\",\"\",IF(AND(BQ13=\"\"),\"\",IF(OR(B7=$AX$24),\"\",IF(AND('Master Data'!$C$14=$AP$5),VLOOKUP(B7,om,7,0),\"\")))),\"\")","v":33715},{"$f":"IFERROR(IF(B7=\"\",\"\",IF(AND(BQ13=\"\"),\"\",IF(OR(B7=$AX$24,B7=$AX$25,B7=$AX$26,B7=$AX$27,B7=$AX$28,B7=$AX$29),\"\",IF(AND('Master Data'!$C$14=$AP$5),VLOOKUP(B7,om,8,0),\"\")))),\"\")","v":6130},{"$f":"IFERROR(IF(B7=\"\",\"\",IF(AND(BQ13=\"\"),\"\",IF(OR(B7=$AX$24,B7=$AX$25,B7=$AX$26,B7=$AX$27,B7=$AX$28,B7=$AX$29),\"\",IF(AND('Master Data'!$C$14=$AP$5),F6,\"\")))),\"\")","v":0},{"$f":"IFERROR(IF(B7=\"\",\"\",IF(AND(BQ13=\"\"),\"\",IF(OR(B7=$AX$24,B7=$AX$25,B7=$AX$26,B7=$AX$27,B7=$AX$28,B7=$AX$29),\"\",IF(AND('Master Data'!$C$14=$AP$5),G6,\"\")))),\"\")","v":0},{"$f":"IFERROR(IF(B7=\"\",\"\",IF(AND(BQ14=\"\"),\"\",IF('Master Data'!$E$12=\"NO\",\"\",IF(OR(B7=$AX$24,B7=$AX$25,B7=$AX$26,B7=$AX$27,B7=$AX$28,B7=$AX$29),\"\",IF(AND('Master Data'!$C$14=$AP$5),F7,IF(AND('Master Data'!$E$13=$AR$9),$AS$6,IF(AND('Master Data'!$E$13=$AR$10),$AS$6,IF(AND('Master Data'!$E$13=$AR$11),$AS$6,IF(AND('Master Data'!$E$13=$AR$12),$AS$6,$AS$5))))))))),\"\")","v":""},{"$f":"IFERROR(IF(B7=\"\",\"\",IF(AND(BQ13=\"\"),\"\",IF(OR(B7=$AX$24,B7=$AX$25,B7=$AX$26,B7=$AX$27,B7=$AX$28,B7=$AX$29),\"\",IF(AND('Master Data'!$C$14=$AP$5),I6,\"\")))),\"\")","v":0},{"$f":"IFERROR(IF(B7=\"\",\"\",IF(AND(BQ13=\"\"),\"\",IF(OR(B7=$AX$24,B7=$AX$25,B7=$AX$26,B7=$AX$27,B7=$AX$28,B7=$AX$29),\"\",IF(AND('Master Data'!$C$14=$AP$5),J6,\"\")))),\"\")","v":0},{"$f":"IFERROR(IF(B7=\"\",\"\",IF(AND('Master Data'!$C$14=$AP$6),\"\",IF(AND('Master Data'!$C$15<>0),IF(AND(B7=\"Bonus\"),VLOOKUP(B7,om,4,0),\"\")))),\"\")","v":""},{"$f":"IFERROR(IF(B7=\"\",\"\",IF(AND(BQ13=\"\"),\"\",IF(OR(B7=$AX$24,B7=$AX$25,B7=$AX$26,B7=$AX$27,B7=$AX$28,B7=$AX$29),\"\",IF(AND('Master Data'!$C$14=$AP$5),L6,\"\")))),\"\")","v":0},{"$f":"IF(B7=\"\",\"\",SUM(C7:L7))","v":101145},{"$f":"IFERROR(IF(B7=\"\",\"\",IF(AND(BQ13=\"\"),\"\",IF(OR(B7=$AX$24,B7=$AX$25,B7=$AX$26,B7=$AX$27,B7=$AX$28,B7=$AX$29),\"\",IF(AND('Master Data'!$C$14=$AP$5),VLOOKUP(B7,om,11,0),\"\")))),\"\")","v":7000},{"$f":"IFERROR(IF(B7=\"\",\"\",IF(AND(BQ13=\"\"),\"\",IF(OR(B7=$AX$25),\"\",IF(AND('Master Data'!$C$14=$AP$5),VLOOKUP(B7,om,12,0),\"\")))),\"\")","v":7000},{"$f":"IFERROR(IF(B7=\"\",\"\",IF(AND(BQ13=\"\"),\"\",IF(OR(B7=$AX$24,B7=$AX$25,B7=$AX$26,B7=$AX$27,B7=$AX$28,B7=$AX$29),\"\",IF(AND('Master Data'!$C$14=$AP$5),'Master Data'!$E$16,\"\")))),\"\")","v":1103},{"$f":"IFERROR(IF(B7=\"\",\"\",IF(AND(BQ13=\"\"),\"\",IF(OR(B7=$AX$24,B7=$AX$25,B7=$AX$26,B7=$AX$27,B7=$AX$28,B7=$AX$29),\"\",IF(AND('Master Data'!$C$14=$AP$5),VLOOKUP(B7,om,10,0),\"\")))),\"\")","v":875},{"$f":"IFERROR(IF(B7=\"\",\"\",IF(AND(BQ13=\"\"),\"\",IF(OR(B7=$AX$24,B7=$AX$25,B7=$AX$26,B7=$AX$27,B7=$AX$28,B7=$AX$29),\"\",IF(AND('Master Data'!$C$14=$AP$5),R6,\"\")))),\"\")","v":0},{"$f":"IFERROR(IF(B7=\"\",\"\",IF(AND(BQ13=\"\"),\"\",IF(OR(B7=$AX$24,B7=$AX$25,B7=$AX$26,B7=$AX$27,B7=$AX$28,B7=$AX$29),\"\",IF(AND('Master Data'!$C$14=$AP$5),S6,\"\")))),\"\")","v":0},{"$f":"IFERROR(IF(B7=\"\",\"\",IF(AND(BQ13=\"\"),\"\",IF(OR(B7=$AX$24,B7=$AX$25,B7=$AX$26,B7=$AX$27,B7=$AX$28,B7=$AX$29),\"\",IF(AND('Master Data'!$C$14=$AP$5),T6,\"\")))),\"\")","v":0},{"$f":"IFERROR(IF(B7=\"\",\"\",IF(AND(BQ13=\"\"),\"\",IF(OR(B7=$AX$24,B7=$AX$25,B7=$AX$26,B7=$AX$27,B7=$AX$28,B7=$AX$29),\"\",IF(AND('Master Data'!$C$14=$AP$5),U6,\"\")))),\"\")","v":0},{"$f":"IFERROR(IF(OR('Master Data'!$C$14=$AP$6,B7=\"\"),\"\",IF(AND(C7=\"\"),\"\",IF(AND(B7=$AT$17,'Master Data'!$C$5=\"Gazetted\"),500,IF(AND(B7=$AT$17,'Master Data'!$C$5=\"Non-Gazetted\"),250,\"\")))),\"\")","v":""},{"$f":"IFERROR(IF(B7=\"\",\"\",IF(AND(BQ13=\"\"),\"\",IF(OR(B7=$AX$24,B7=$AX$25,B7=$AX$26,B7=$AX$27,B7=$AX$28,B7=$AX$29),\"\",IF(AND('Master Data'!$C$14=$AP$5),W6,\"\")))),\"\")","v":0},{"$f":"IFERROR(IF(B7=\"\",\"\",IF(AND(BQ13=\"\"),\"\",IF(OR(B7=$AX$24,B7=$AX$25,B7=$AX$26,B7=$AX$27,B7=$AX$28,B7=$AX$29),\"\",IF(AND('Master Data'!$C$14=$AP$5),VLOOKUP(B7,om,9,0),\"\")))),\"\")","v":2000},{"$f":"IFERROR(IF(OR('Master Data'!$C$14=$AP$6,B7=\"\",'Master Data'!$C$11=\"\"),\"\",IF(AND(C7=\"\"),\"\",IF(B7=$AT$9,'Master Data'!$C$16,\"\"))),\"\")","v":0},{"$f":"IF(B7=\"\",\"\",SUM(N7:Y7))","v":17978},{"$f":"IFERROR(IF(AND(B7=\"\",M7=\"\",Z7=\"\"),\"\",SUM(M7-Z7)),\"\")","v":83167},{"$nulls":15},"Above 80"]
[3,{"$f":"IFERROR(IF(BO14=\"\",\"\",BO14),\"\")","v":"2025-05-01"},{"$f":"IFERROR(IF(B8=\"\",\"\",IF(AND(BQ14=\"\"),\"\",IF(B8=$AX$24,\"\",IF(AND('Master Data'!$C$14=$AP$6),VLOOKUP(B8,om,13,0),VLOOKUP(B8,om,4,0))))),\"\")","v":61300},{"$f":"IFERROR(IF(B8=\"\",\"\",IF(AND(BQ14=\"\"),\"\",IF(OR(B8=$AX$24),\"\",IF(AND('Master Data'!$C$14=$AP$5),VLOOKUP(B8,om,7,0),\"\")))),\"\")","v":33715},{"$f":"IFERROR(IF(B8=\"\",\"\",IF(AND(BQ14=\"\"),\"\",IF(OR(B8=$AX$24,B8=$AX$25,B8=$AX$26,B8=$AX$27,B8=$AX$28,B8=$AX$29),\"\",IF(AND('Master Data'!$C$14=$AP$5),VLOOKUP(B8,om,8,0),\"\")))),\"\")","v":6130},{"$f":"IFERROR(IF(B8=\"\",\"\",IF(AND(BQ14=\"\"),\"\",IF(OR(B8=$AX$24,B8=$AX$25,B8=$AX$26,B8=$AX$27,B8=$AX$28,B8=$AX$29),\"\",IF(AND('Master Data'!$C$14=$AP$5),F7,\"\")))),\"\")","v":0},{"$f":"IFERROR(IF(B8=\"\",\"\",IF(AND(BQ14=\"\"),\"\",IF(OR(B8=$AX$24,B8=$AX$25,B8=$AX$26,B8=$AX$27,B8=$AX$28,B8=$AX$29),\"\",IF(AND('Master Data'!$C$14=$AP$5),G7,\"\")))),\"\")","v":0},{"$f":"IFERROR(IF(B8=\"\",\"\",IF(AND(BQ15=\"\"),\"\",IF('Master Data'!$E$12=\"NO\",\"\",IF(OR(B8=$AX$24,B8=$AX$25,B8=$AX$26,B8=$AX$27,B8=$AX$28,B8=$AX$29),\"\",IF(AND('Master Data'!$C$14=$AP$5),F8,IF(AND('Master Data'!$E$13=$AR$9),$AS$6,IF(AND('Master Data'!$E$13=$AR$10),$AS$6,IF(AND('Master Data'!$E$13=$AR$11),$AS$6,IF(AND('Master Data'!$E$13=$AR$12),$AS$6,$AS$5))))))))),\"\")","v":""},{"$f":"IFERROR(IF(B8=\"\",\"\",IF(AND(BQ14=\"\"),\"\",IF(OR(B8=$AX$24,B8=$AX$25,B8=$AX$26,B8=$AX$27,B8=$AX$28,B8=$AX$29),\"\",IF(AND('Master Data'!$C$14=$AP$5),I7,\"\")))),\"\")","v":0},{"$f":"IFERROR(IF(B8=\"\",\"\",IF(AND(BQ14=\"\"),\"\",IF(OR(B8=$AX$24,B8=$AX$25,B8=$AX$26,B8=$AX$27,B8=$AX$28,B8=$AX$29),\"\",IF(AND('Master Data'!$C$14=$AP$5),J7,\"\")))),\"\")","v":0},{"$f":"IFERROR(IF(B8=\"\",\"\",IF(AND('Master Data'!$C$14=$AP$6),\"\",IF(AND('Master Data'!$C$15<>0),IF(AND(B8=\"Bonus\"),VLOOKUP(B8,om,4,0),\"\")))),\"\")","v":""},{"$f":"IFERROR(IF(B8=\"\",\"\",IF(AND(BQ14=\"\"),\"\",IF(OR(B8=$AX$24,B8=$AX$25,B8=$AX$26,B8=$AX$27,B8=$AX$28,B8=$AX$29),\"\",IF(AND('Master Data'!$C$14=$AP$5),L7,\"\")))),\"\")","v":0},101145,{"$f":"IFERROR(IF(B8=\"\",\"\",IF(AND(BQ14=\"\"),\"\",IF(OR(B8=$AX$24,B8=$AX$25,B8=$AX$26,B8=$AX$27,B8=$AX$28,B8=$AX$29),\"\",IF(AND('Master Data'!$C$14=$AP$5),VLOOKUP(B8,om,11,0),\"\")))),\"\")","v":7000},{"$f":"IFERROR(IF(B8=\"\",\"\",IF(AND(BQ14=\"\"),\"\",IF(OR(B8=$AX$25),\"\",IF(AND('Master Data'!$C$14=$AP$5),VLOOKUP(B8,om,12,0),\"\")))),\"\")","v":7000},{"$f":"IFERROR(IF(B8=\"\",\"\",IF(AND(BQ14=\"\"),\"\",IF(OR(B8=$AX$24,B8=$AX$25,B8=$AX$26,B8=$AX$27,B8=$AX$28,B8=$AX$29),\"\",IF(AND('Master Data'!$C$14=$AP$5),'Master Data'!$E$16,\"\")))),\"\")","v":1103},{"$f":"IFERROR(IF(B8=\"\",\"\",IF(AND(BQ14=\"\"),\"\",IF(OR(B8=$AX$24,B8=$AX$25,B8=$AX$26,B8=$AX$27,B8=$AX$28,B8=$AX$29),\"\",IF(AND('Master Data'!$C$14=$AP$5),VLOOKUP(B8,om,10,0),\"\")))),\"\")","v":875},{"$f":"IFERROR(IF(B8=\"\",\"\",IF(AND(BQ14=\"\"),\"\",IF(OR(B8=$AX$24,B8=$AX$25,B8=$AX$26,B8=$AX$27,B8=$AX$28,B8=$AX$29),\"\",IF(AND('Master Data'!$C$14=$AP$5),R7,\"\")))),\"\")","v":0},{"$f":"IFERROR(IF(B8=\"\",\"\",IF(AND(BQ14=\"\"),\"\",IF(OR(B8=$AX$24,B8=$AX$25,B8=$AX$26,B8=$AX$27,B8=$AX$28,B8=$AX$29),\"\",IF(AND('Master Data'!$C$14=$AP$5),S7,\"\")))),\"\")","v":0},{"$f":"IFERROR(IF(B8=\"\",\"\",IF(AND(BQ14=\"\"),\"\",IF(OR(B8=$AX$24,B8=$AX$25,B8=$AX$26,B8=$AX$27,B8=$AX$28,B8=$AX$29),\"\",IF(AND('Master Data'!$C$14=$AP$5),T7,\"\")))),\"\")","v":0},{"$f":"IFERROR(IF(B8=\"\",\"\",IF(AND(BQ14=\"\"),\"\",IF(OR(B8=$AX$24,B8=$AX$25,B8=$AX$26,B8=$AX$27,B8=$AX$28,B8=$AX$29),\"\",IF(AND('Master Data'!$C$14=$AP$5),U7,\"\")))),\"\")","v":0},{"$f":"IFERROR(IF(OR('Master Data'!$C$14=$AP$6,B8=\"\"),\"\",IF(AND(C8=\"\"),\"\",IF(AND(B8=$AT$17,'Master Data'!$C$5=\"Gazetted\"),500,IF(AND(B8=$AT$17,'Master Data'!$C$5=\"Non-Gazetted\"),250,\"\")))),\"\")","v":""},{"$f":"IFERROR(IF(B8=\"\",\"\",IF(AND(BQ14=\"\"),\"\",IF(OR(B8=$AX$24,B8=$AX$25,B8=$AX$26,B8=$AX$27,B8=$AX$28,B8=$AX$29),\"\",IF(AND('Master Data'!$C$14=$AP$5),W7,\"\")))),\"\")","v":0},{"$f":"IFERROR(IF(B8=\"\",\"\",IF(AND(BQ14=\"\"),\"\",IF(OR(B8=$AX$24,B8=$AX$25,B8=$AX$26,B8=$AX$27,B8=$AX$28,B8=$AX$29),\"\",IF(AND('Master Data'!$C$14=$AP$5),VLOOKUP(B8,om,9,0),\"\")))),\"\")","v":2000},{"$f":"IFERROR(IF(OR('Master Data'!$C$14=$AP$6,B8=\"\",'Master Data'!$C$11=\"\"),\"\",IF(AND(C8=\"\"),\"\",IF(B8=$AT$9,'Master Data'!$C$16,\"\"))),\"\")","v":""},17978,83167,{"$nulls":3},"https://youtu.be/wU0JpB3heTQ",{"$nulls":12},"Jaipur (U.A.)","JAN","2025-03-01","L-1",null,null,"2024-03-01"]
{"$rows_left_out":28}
{"sheet":"COMPUTATION","index":3,"n_rows":73,"n_cols":34,"rows_kept":73,"merged":[[0,0,0,14],[1,2,1,4],[1,5,1,6],[1,7,1,8],[1,9,1,10],[1,11,1,14],[2,1,2,2],[2,3,2,7],[2,9,2,11],[2,13,2,14],[3,1,3,12],[4,1,4,12],[5,1,5,12],[6,0,9,0],[6,1,6,9],[6,10,6,12],[6,13,8,14],[7,1,7,9],[7,10,7,12],[8,1,8,9],[8,10,8,12],[9,1,9,9],[9,10,9,12],[10,1,10,12],[11,0,13,0],[11,1,11,7],[11,8,11,9],[11,10,11,12],[11,13,13,14],[12,1,13,2],[12,3,12,4],[12,5,12,7],[12,8,12,9],[12,10,12,12],[13,3,13,4],[13,5,13,7],[13,8,13,9],[13,10,13,12],[14,1,14,12],[15,1,15,3],[15,4,15,5],[15,6,15,7],[15,9,15,12],[16,1,16,3],[16,4,16,5],[16,6,16,7],[16,9,16,12],[17,1,17,12],[18,0,34,0],[18,1,18,14],[19,1,19,14],[20,2,20,4],[20,8,20,10],[20,13,30,14],[21,2,21,4],[21,8,21,10],[22,2,22,4],[22,8,22,10],[23,2,23,4],[23,8,23,10],[24,2,24,4],[24,8,24,10],[25,2,25,4],[25,8,25,10],[26,2,26,4],[26,8,26,10],[27,2,27,4],[27,8,27,10],[28,2,28,4],[28,8,28,10],[29,2,29,4],[29,8,29,10],[30,2,30,4],[30,7,30,10],[31,1,31,12],[32,1,32,12],[33,1,33,12],[34,1,34,12],[35,0,46,0],[35,1,35,14],[36,1,36,12],[37,1,37,12],[38,1,38,12],[39,1,39,12],[40,1,40,12],[41,1,41,12],[42,1,42,12],[43,1,43,12],[44,1,44,12],[45,1,45,12],[46,1,46,12],[47,1,47,12],[48,1,48,12],[49,1,49,12],[50,0,64,0],[50,1,50,14],[50,23,50,25],[50,27,50,29],[51,1,51,8],[51,9,51,13],[52,1,52,7],[52,9,52,11],[53,1,53,7],[53,9,53,11],[54,1,54,7],[54,9,54,11],[55,1,55,7],[55,9,55,11],[55,15,60,18],[56,1,56,7],[56,9,56,11],[57,1,57,7],[57,9,57,11],[59,1,59,7],[59,9,59,11],[60,1,60,12],[61,1,61,7],[61,9,61,11],[61,16,61,17],[62,1,62,12],[63,2,63,12],[64,1,64,12],[65,1,65,12],[66,1,66,12],[67,0,68,0],[67,1,68,3],[67,4,67,6],[67,7,67,8],[67,10,67,11],[67,12,67,13],[68,4,68,6],[68,7,68,8],[68,10,68,11],[68,12,68,13],[69,0,69,12],[70,1,70,9],[71,11,71,13]]}
[{"$f":"IF('Master Data'!C3=\"\",\"\",CONCATENATE(\"Office of the Principal\",\" , \",'Master Data'!C3))","v":"Office of the Principal , Mahatma Gandhi Government School (English Medium) Bar, (Beawar)"}]
[null,null,"आयकर गणना प्रपत्र वर्ष -",null,null,"2025-2026",null,"( कर निर्धारण वर्ष - ",null,"2026-2027)",null,"New Tax Regime"]
[1,"नाम कर्मचारी :-",null,{"$f":"IF('Master Data'!C4=\"\",\"\",UPPER('Master Data'!C4))","v":"HEERALAL JAT"},{"$nulls":4},"पद :-",{"$f":"IF('Master Data'!E4=\"\",\"\",UPPER('Master Data'!E4))","v":"SR. TEACHER"},null,null,"PAN :",{"$f":"IF('Master Data'!C7=\"\",\"\",UPPER('Master Data'!C7))","v":"ABCDE5555H"}]
[2,"आय : वर्ष  2025-26  में प्राप्त कुल आय ( कर योग्य मूल्यों सहित ) ",{"$nulls":11},"रु.",{"$f":"IF('GA55'!M27=\"\",\"\",'GA55'!M27)","v":1311720}]
[3,"गृह किराया धारा 10 (13-A) के अंतर्गत व धारा  10(14) के अंतर्गत भत्ते  तथा अन्य भत्ते जो कर मुक्त है I",{"$nulls":11},"रु.",{"$f":"IF($L$2=\"Old Tax Regime\",SUM('Extra Ded. '!E6+'Extra Ded. '!K7+'GA55'!G27),0)","v":0}]
[4,"शेष ( 2-3) ",{"$nulls":11},"रु.",{"$f":"SUM(O4-O5)","v":1311720}]
[5,"  (i) मनोरंजन भत्ता धारा  16  (ii) के अंतर्गत  ( अधिकतम सीमा रू 5000 )",{"$nulls":8},{"$f":"IF($L$2=\"Old Tax Regime\",'Extra Ded. '!E8,0)","v":0}]
[null," (ii) व्यवसाय कर  धारा  16  (iii) के अंतर्गत  ( अधिकतम सीमा रू 2500 )",{"$nulls":8},{"$f":"IF($L$2=\"Old Tax Regime\",'Extra Ded. '!E9,0)","v":0}]
{"$rows_left_out":66}
{"sheet":"Form No. 16","index":4,"n_rows":139,"n_cols":18,"rows_kept":139,"merged":[[0,1,0,11],[1,1,1,11],[2,1,2,11],[3,1,3,11],[4,1,4,5],[4,6,4,11],[5,1,5,5],[5,6,5,11],[6,1,6,5],[6,6,6,11],[7,1,7,3],[7,4,7,5],[7,6,7,8],[7,9,7,11],[8,1,8,3],[8,4,8,5],[8,6,8,8],[8,9,8,11],[9,1,9,5],[9,6,9,7],[9,8,9,11],[10,2,10,5],[10,6,11,7],[10,8,10,9],[10,10,10,11],[11,2,11,3],[11,8,11,9],[11,10,11,11],[12,1,12,11],[13,2,13,4],[13,6,13,8],[13,9,13,11],[14,2,14,4],[14,6,14,8],[14,9,14,11],[15,2,15,4],[15,6,15,8],[15,9,15,11],[16,2,16,4],[16,6,16,8],[16,9,16,11],[17,2,17,4],[17,6,17,8],[17,9,17,11],[18,1,18,4],[18,6,18,8],[18,9,18,11],[19,1,19,11],[20,1,20,11],[21,1,22,1],[21,2,22,3],[21,4,21,11],[22,6,22,8],[22,9,22,11],[23,2,23,3],[23,6,23,8],[23,9,23,11],[24,2,24,3],[24,6,24,8],[24,9,24,11],[25,2,25,3],[25,6,25,8],[25,9,25,11],[26,2,26,3],[26,6,26,8],[26,9,26,11],[27,2,27,3],[27,6,27,8],[27,9,27,11],[28,2,28,3],[28,6,28,8],[28,9,28,11],[29,2,29,3],[29,6,29,8],[29,9,29,11],[30,2,30,3],[30,6,30,8],[30,9,30,11],[31,2,31,3],[31,6,31,8],[31,9,31,11],[32,2,32,3],[32,6,32,8],[32,9,32,11],[33,2,33,3],[33,6,33,8],[33,9,33,11],[34,2,34,3],[34,6,34,8],[34,9,34,11],[35,2,35,3],[35,6,35,8],[35,9,35,11],[36,2,36,3],[36,4,36,11],[37,1,37,11],[38,1,38,11],[39,1,40,1],[39,2,40,3],[39,4,39,11],[40,4,40,5],[40,6,40,7],[40,8,40,9],[40,10,40,11],[41,2,41,3],[41,4,41,5],[41,6,41,7],[41,8,41,9],[41,10,41,11],[42,2,42,3],[42,4,42,5],[42,6,42,7],[42,8,42,9],[42,10,42,11],[43,2,43,3],[43,4,43,5],[43,6,43,7],[43,8,43,9],[43,10,43,11],[44,2,44,3],[44,4,44,5],[44,6,44,7],[44,8,44,9],[44,10,44,11],[45,2,45,3],[45,4,45,5],[45,6,45,7],[45,8,45,9],[45,10,45,11],[46,2,46,3],[46,4,46,5],[46,6,46,7],[46,8,46,9],[46,10,46,11],[47,2,47,3],[47,4,47,5],[47,6,47,7],[47,8,47,9],[47,10,47,11],[48,2,48,3],[48,4,48,5],[48,6,48,7],[48,8,48,9],[48,10,48,11],[49,2,49,3],[49,4,49,5],[49,6,49,7],[49,8,49,9],[49,10,49,11],[50,2,50,3],[50,4,50,5],[50,6,50,7],[50,8,50,9],[50,10,50,11],[51,2,51,3],[51,4,51,5],[51,6,51,7],[51,8,51,9],[51,10,51,11],[52,2,52,3],[52,4,52,5],[52,6,52,7],[52,8,52,9],[52,10,52,11],[53,2,53,3],[53,4,53,11],[54,1,54,11],[55,1,55,11],[56,2,56,4],[56,6,56,9],[56,10,56,11],[57,1,57,2],[57,3,57,5],[57,6,57,11],[58,3,58,7],[58,8,58,11],[59,1,59,11],[60,1,60,11],[61,1,61,2],[61,3,61,4],[61,5,61,11],[62,1,62,2],[62,3,62,4],[62,5,62,11],[63,1,63,2],[63,3,63,4],[63,6,63,11],[64,1,64,11],[65,1,65,11],[66,1,66,5],[66,6,66,7],[66,8,69,9],[66,10,80,11],[67,1,67,5],[67,6,67,7],[68,1,68,5],[68,6,68,7],[69,1,69,5],[69,6,69,7],[70,1,70,5],[70,6,73,7],[70,8,70,9],[71,1,71,5],[71,8,74,9],[72,1,72,5],[73,1,73,3],[74,1,74,3],[74,6,74,7],[75,1,75,5],[75,6,76,7],[75,8,75,9],[76,1,76,5],[76,8,79,9],[77,1,77,2],[77,3,77,5],[77,6,77,7],[78,1,78,2],[78,3,78,5],[78,6,78,7],[79,1,79,2],[79,3,79,5],[79,6,79,7],[80,1,80,5],[80,8,80,9],[81,1,81,5],[81,8,88,9],[81,10,81,11],[82,1,82,5],[82,10,84,11],[83,1,83,2],[83,3,83,4],[84,1,84,2],[84,3,84,4],[84,6,84,7],[85,1,85,2],[85,3,85,4],[85,6,85,7],[85,10,85,11],[86,1,86,5],[86,6,88,7],[87,1,87,4],[88,1,88,4],[89,1,89,4],[89,6,89,7],[89,8,89,9],[90,1,90,9],[90,10,90,11],[91,1,91,11],[92,1,92,11],[93,1,93,5],[93,6,93,7],[93,8,93,9],[93,10,93,11],[94,1,107,1],[94,3,106,3],[94,4,94,5],[94,6,94,7],[94,8,105,9],[94,10,105,11],[95,4,95,5],[95,6,95,7],[96,4,96,5],[96,6,96,7],[97,4,97,5],[97,6,97,7],[98,4,98,5],[98,6,98,7],[99,4,99,5],[99,6,99,7],[100,4,100,5],[100,6,100,7],[101,4,101,5],[101,6,101,7],[102,4,102,5],[102,6,102,7],[103,4,103,5],[103,6,103,7],[104,4,104,5],[104,6,104,7],[105,4,105,5],[105,6,105,7],[106,4,106,5],[106,6,106,7],[106,8,106,9],[106,10,106,11],[107,2,107,5],[107,6,107,7],[107,8,107,9],[107,10,107,11],[108,8,108,10],[109,1,109,11],[110,1,110,5],[110,6,110,7],[110,8,110,9],[110,10,110,11],[111,2,111,5],[111,6,111,7],[111,8,111,9],[111,10,118,11],[112,2,112,5],[112,6,112,7],[112,8,112,9],[113,2,113,5],[113,6,113,7],[113,8,113,9],[114,2,114,5],[114,6,114,7],[114,8,114,9],[115,2,115,5],[115,6,115,7],[115,8,115,9],[116,2,116,5],[116,6,116,7],[116,8,116,9],[117,2,117,5],[117,6,117,7],[117,8,117,9],[118,2,118,5],[118,6,118,7],[118,8,118,9],[119,2,119,5],[119,6,119,7],[119,8,119,9],[119,10,119,11],[120,1,120,9],[120,10,120,11],[121,1,121,3],[121,4,121,9],[121,10,121,11],[122,1,122,9],[122,10,122,11],[123,1,123,9],[123,10,123,11],[124,1,124,9],[124,10,124,11],[125,1,125,9],[125,10,125,11],[126,1,126,9],[126,10,126,11],[127,1,127,9],[127,10,127,11],[128,1,128,9],[128,10,128,11],[129,1,129,9],[129,10,129,11],[130,1,130,9],[130,10,130,11],[131,1,131,11],[132,2,132,4],[132,6,132,9],[132,10,132,11],[133,1,133,2],[133,3,133,5],[133,6,133,11],[134,3,134,7],[134,8,134,11],[135,1,135,11],[136,1,136,2],[136,3,136,4],[136,5,136,11],[137,1,137,2],[137,3,137,4],[137,5,137,11],[138,1,138,2],[138,3,138,4],[138,6,138,11]]}
[null,"FORM NO. 16"]
[null,"[(See Rule 31(1)(a)]"]
[null,"PART-A"]
[null,"Certificate under section 203 of the income-tax act, 1961 for Tax deducted at source on Salary."]
[null,"Name and address of the Employer",{"$nulls":4},"Name and adress of the Employee"]
[null,{"$f":"IF('Master Data'!E6=\"\",\"\",UPPER('Master Data'!E6))","v":"USHA PALIYA"},{"$nulls":4},{"$f":"IF('Master Data'!C4=\"\",\"\",UPPER('Master Data'!C4))","v":"HEERALAL JAT"}]
[{"$nulls":6},{"$f":"IF('Master Data'!C6=\"\",\"\",UPPER('Master Data'!C6))","v":"MGGS BAR"}]
[null,"PAN of the Deductor",null,null,"TAN of  the Deductor",null,"PAN of the Employee",null,null,"Employee Ref No."]
{"$rows_left_out":131}